Friedrich Stuhlmüller GmbH (Hamburg)
type: Concept
type: corporation
definition: Die Firma bestand vom 9. Februar 1961 bis zum 12. Juli 1996.Das Münzkabinett Berlin erwarb Medaillen von der Firma aus dem Nachlass des Medailleurs Friedrich Stuhlmüller (1908-1993) im Jahre 1994.
definition: The company operated from 9 February 1961 to 12 July 1996.The Münzkabinett Berlin purchased medals from this company from the bequest of the medalist Friedrich Stuhlmüller (1908-1993) in 1994. @en
function or role: Veräußerer (an Museum)
in scheme: corporation
created: 2024-05-10
modified: 2024-05-10

Veräußerer (an Museum)
preferred label: Vendor (to Museum) @en