Whitby Association
type: Concept
type: corporation
definition: Zusammenschluss mehrerer Kaufleute aus Whitby, die sich jedoch nicht mehr einzeln feststellen lassen. Ausgabe von Marken 1811.Lit.: P. und B. R. Withers, British Tokens of the 17th 18th and 19th centuries and their values (2010) 421 Yorkshire Nr. 75.
definition: An association of merchants from Whitby, which issued tokens under that name in 1811. Its members cannot be identified, though.Lit.: P. and B. R. Withers, British Tokens of the 17th 18th and 19th centuries and their values (2010) p. 421 Yorkshire no. 75. @en
function or role: Münzherr
in scheme: corporation
created: 2024-05-10
modified: 2024-05-10

Münzherr
preferred label: Authority @en