J. Niblock & R. S. Latham
type: Concept
type: corporation
definition: Auktionator und Stoffhändler in Bristol. Ausgabe von Marken 1811.Führten 1811 je ein Geschäft in 18 Bridge Street (Auktion) und 19 Bridge Street (Wollhandel). Sie unterhielten auch ein Geschäft in Trowbridge.Wahrscheinlich derselbe Niblock, der 1795 Marken zusammen mit einem Mr. Hunter ausgab.Firma bankrott 1821.Lit.: J. O'Donald Mays, Silver Tokens and Bristol, The British Numismatic Journal 48, 1978, 102.
definition: Auctioneer and draper in Bristol. Issued tokens in 1811.In 1811 their business was at 18 Bridge Street (auctions), and 19 Bridge Street (woollen drapery). They also conducted their business at Trowbridge.Possibly the same Niblock, who in 1795 issued tokens together with a Mr. Hunter.Declared bankrupt in 1821.Lit.: J. O'Donald Mays, Silver Tokens and Bristol, The British Numismatic Journal 48, 1978, p. 102. @en
function or role: Münzherr
in scheme: corporation
created: 2024-05-10
modified: 2024-05-10

Münzherr
preferred label: Authority @en