J. Millson & T. Preston
type: Concept
type: corporation
definition: Wein- und Spirituosenhändler in Lincoln. Ausgabe von Marken 1812.Lit.: P. und B. R. Withers, The Token Book. British Tokens of the 17th 18th and 19th centuries and their values (2010) 401 Lincolnshire Nr. 12.
definition: Wine and spirit dealers in Loncoln. Issued tokens in 1812.Lit.: P. and B. R. Withers, The Token Book. British Tokens of the 17th 18th and 19th centuries and their values (2010) p. 401 Lincolnshire no. 12. @en
function or role: Münzherr
in scheme: corporation
created: 2024-05-10
modified: 2024-05-10

Münzherr
preferred label: Authority @en