J. Younge & J. Deakin
type: Concept
type: corporation
definition: Knopfmacher in Sheffield. Gaben eigene Marken 1811/1812 aus und stellen solche auch für andere Ausgeber (z.B. Thomason) her.Geschäft/Fabrik in Union Street.Lit.: P. und B. R. Withers, The Token Book. British Tokens of the 17th 18th and 19th centuries and their values (2010) 421 Yorkshire Nr. 75; W. J. Davis, The Nineteenth Century Token coinage of Great Britain Ireland the Channel Islands and the Isle of Man to which are added Tokens over one Penny value of any period (1904/Nachdruck 1969) 186 Nr. 151.
definition: Merchants and button manufacturers in Sheffield. They issued their own tokens in 1811/1812 and produced for other companies (e.g. Thomason).Company based in Union Street.Lit.: P. and B. R. Withers, The Token Book. British Tokens of the 17th 18th and 19th centuries and their values (2010) p. 421 Yorkshire no. 75; W. J. Davis, The Nineteenth Century Token coinage of Great Britain Ireland the Channel Islands and the Isle of Man to which are added Tokens over one Penny value of any period (1904/reprint 1969) p. 186 no. 151. @en
function or role: Hersteller
function or role: Münzherr
in scheme: corporation
created: 2024-05-10
modified: 2024-05-10

Hersteller
preferred label: Producer @en

Münzherr
preferred label: Authority @en