Marlborough Old Bank (Marlborough & Wiltshire Bank)
type: Concept
type: corporation
definition: Provinziale Bank, aktiv von 1795 bis 1853.Zusammenschluss u.a. von William Tanner, George Henry, Stephen King, Robert Griffiths und John Gosling.Ausgabe von Marken 1811. Auch Ausgabe von Banknoten.Lit.: P. und B. R. Withers, The Token Book. British Tokens of the 17th 18th and 19th centuries and their values (2010) 416 Nr. 1.
definition: Provincial Bank, active from 1795 to 1853.Owned by among others William Tanner, George Henry, Stephen King, Robert Griffiths and John Gosling.The Bank issued tokens in 1811, and paper money.Lit.: P. and B. R. Withers, The Token Book. British Tokens of the 17th 18th and 19th centuries and their values (2010) p. 416 no. 1. @en
function or role: Münzherr
in scheme: corporation
created: 2024-05-10
modified: 2024-05-10

Münzherr
preferred label: Authority @en