Robert Tripp & Co.
type: Concept
type: corporation
definition: Schneider in 37 Quay, Bristol mit weiterer Geschäftsstelle in der Duke Street.Ausgabe von Marken 1811. Bankrott am 10. Juni 1817.Lit.: P. und B. R. Withers, The Token Book. British Tokens of the 17th 18th and 19th centuries and their values (2010) 411 Nr. 51-52.
definition: Tailor at 37 Quay, Bristol with additional offices in Duke Street.Robert Tripp & Company issued tokens in 1811. The company filed for bankruptcy 10 June 1817.Lit.: P. and B. R. Withers, The Token Book. British Tokens of the 17th 18th and 19th centuries and their values (2010) p. 411 nos. 51-52. @en
function or role: Münzherr
in scheme: corporation
created: 2024-05-10
modified: 2024-05-10

Münzherr
preferred label: Authority @en