William Lomer & Son
type: Concept
type: corporation
definition: Teehändler und Lebensmittelgroßhändler in Southampton.Lomer und Sohn gaben um 1811 (undatierte) Marken aus.Lit.: P. und B. R. Withers, The Token Book. British Tokens of the 17th 18th and 19th centuries and their values (2010) 397 Nr. 42.
definition: Tea merchant and grocer in Southampton.Lomer and Son issued (undated) tokens around 1811.Lit.: P. and B. R. Withers, The Token Book. British Tokens of the 17th 18th and 19th centuries and their values (2010) p. 397 no. 42. @en
function or role: Münzherr
in scheme: corporation
created: 2024-05-10
modified: 2024-05-10

Münzherr
preferred label: Authority @en