Nantwich Bank
type: Concept
type: corporation
definition: Bank in Nantwich, Cheshire. Bestand von 1808 bis 1826. Bankrott 1826.Ausgabe von Marken um 1811 und von Papiergeldnoten.Lit.: P. und B. R. Withers, The Token Book. British Tokens of the 17th 18th and 19th centuries and their values (2010) 390 Nr. 1.
definition: Provincial bank in Nantwich, Chesire. Established in 1808, bankrupt in 1826.Issued tokens around 1811, and paper money.Lit.: P. and B. R. Withers, The Token Book. British Tokens of the 17th 18th and 19th centuries and their values (2010) p. 390 no. 1. @en
function or role: Münzherr
in scheme: corporation
created: 2024-05-10
modified: 2024-05-10

Münzherr
preferred label: Authority @en