Bristol Commercial Token Company
type: Concept
type: corporation
definition: Zusammenschluss der Herren Francis Garratt, William Terrell, Edward Bird, Lancelot Beck und Francis Hore Grigg.Ausgabe von Marken 1811. Diese ließen sie in Birmingham produzieren. Sie gaben auch eine 1 Pfund- und eine 5 Pfund-Note aus.Lit.: J. O'Donald Mays, Silver Tokens and Bristol, The British Numismatic Journal 48, 1978, 102; P. und B. R. Withers, The Token Book. British Tokens of the 17th 18th and 19th centuries and their values (2010) 409 Nr. 23-9; A.W. Waters, Notes on the Silver Tokens of the Nineteenth Century (1957) 11 unter Bristol.
definition: Consortium of five traders, Francis Garratt, William Terrell, Edward Bird, Lancelot Beck, and Francis Hore Grigg in Bristol.The so-called Garrat group issued tokens in 1811 (and also one-pound and five-pound notes).Lit.: J. O'Donald Mays, Silver Tokens and Bristol, The British Numismatic Journal 48, 1978, p. 102; P. and B. R. Withers, The Token Book. British Tokens of the 17th 18th and 19th centuries and their values (2010) p. 409 nos. 23-9; A.W. Waters, Notes on the Silver Tokens of the Nineteenth Century (1957) p. 11 under Bristol. @en
function or role: Münzherr
in scheme: corporation
created: 2024-05-10
modified: 2024-05-10

Münzherr
preferred label: Authority @en