Hancock, Wakefield & Co
type: Concept
type: corporation
definition: Firma von John und Matthew Hancock sowie Francis Wakefield, Baumwollfabrikanten mit Niederlassungen in Nottingham, Mansfield und London.Ausgabe von Marken 1812, zusammen mit Charles und George Stanton sowie William EllisLit.: P. und B. R. Withers, The Token Book. British Tokens of the 17th 18th and 19th centuries and their values (2010) 407 Nr. 2-3.
definition: Company of John & Matthew Hancock and Francis Wakefield, Cotton manufacturers with businesses in Nottingham, Mansfield, and London.The company issued tokens in 1812, together with Charles & George Stanton, and William EllisLit.: P. and B. R. Withers, The Token Book. British Tokens of the 17th 18th and 19th centuries and their values (2010) p. 407 nos. 2-3. @en
function or role: Münzherr
in scheme: corporation
created: 2024-05-10
modified: 2024-05-10

Münzherr
preferred label: Authority @en