Wainwright & Co
type: Concept
type: corporation
definition: Chemiker und Mälzer in Hereford, Herefordshire.Ausgabe von Marken 1811, zusammen mit Carless & Co.Lit.: P. und B. R. Withers, The Token Book. British Tokens of the 17th 18th and 19th centuries and their values (2010) 398 Nr. 1-2; A.W. Waters, Notes on the Silver Tokens of the Nineteenth Century (1957) 6 unter Hereford (bankrott 1815); W. J. Davis, The Nineteenth Century Token coinage of Great Britain Ireland the Channel Islands and the Isle of Man to which are added Tokens over one Penny value of any period (1904/Nachdruck 1969) 61 Nr. 1-2 (bankrott 22. Nov. 1822).
definition: Chemists and maltsters in Hereford, Herefordshire.Wainwright & Company issued tokens in 1811 together with Carless & Company.Lit.: P. and B. R. Withers, The Token Book. British Tokens of the 17th 18th and 19th centuries and their values (2010) p. 398 nos. 1-2; A.W. Waters, Notes on the Silver Tokens of the Nineteenth Century (1957) p. 6 under Hereford (bankrupt 1815); W. J. Davis, The Nineteenth Century Token coinage of Great Britain Ireland the Channel Islands and the Isle of Man to which are added Tokens over one Penny value of any period (1904/reprint 1969) p. 61 nos. 1-2 (bankrupt 22 Nov. 1822). @en
function or role: Münzherr
in scheme: corporation
created: 2024-05-10
modified: 2024-05-10

Münzherr
preferred label: Authority @en