William, Samuel & Joseph Wakeford
type: Concept
type: corporation
definition: Banker in Andover, Hampshire.Ausgabe von Marken 1811 und 1812. Ausgabe von Banknoten. Bank geschlossen 1825.Lit.: P. und B. R. Withers, The Token Book. British Tokens of the 17th 18th and 19th centuries and their values (2010) 396 Nr. 20-23; W. J. Davis, The Nineteenth Century Token coinage of Great Britain Ireland the Channel Islands and the Isle of Man to which are added Tokens over one Penny value of any period (1904/Nachdruck 1969) 57 Nr. 20; A.W. Waters, Notes on the Silver Tokens of the Nineteenth Century (1957) 5 unter Andover.
definition: Bankers in Andover, Hampshire.The bank isued tokens in 1811 and 1812; they also issued banknotes. Bank closed in 1825.Lit.: P. and B. R. Withers, The Token Book. British Tokens of the 17th 18th and 19th centuries and their values (2010) p. 396 nos. 20-23; W. J. Davis, The Nineteenth Century Token coinage of Great Britain Ireland the Channel Islands and the Isle of Man to which are added Tokens over one Penny value of any period (1904/reprint 1969) p. 57 no. 20; A.W. Waters, Notes on the Silver Tokens of the Nineteenth Century (1957) p. 5 under Andover. @en
function or role: Münzherr
in scheme: corporation
created: 2024-05-10
modified: 2024-05-10

Münzherr
preferred label: Authority @en