William Lintott & Sons
type: Concept
type: corporation
definition: Kohle- und Weinhändler mit Niederlassung in Southampton, außerdem Besitzer einer Flachsmühle in Romsey, Hampshire.Mehrfacher Bürgermeister von Romsey.Ausgabe von Marken 1812.Laut Withers ist William Henry Lintott 1816 verstorben, in diesem Fall müsste er einen Sohn gleichen Namens gehabt haben, da 1822 wieder ein William Henry Lintott Bürgermeister von Romsey war.Lit.: P. und B. R. Withers, The Token Book. British Tokens of the 17th 18th and 19th centuries and their values (2010) 397 Nr. 41.
definition: Coal and wine merchants with businesses in Southampton, and owner of a flax mill in Romsey, Hampshire.Henry William Lintott also was mayor of Romsey.The company issued tokens in 1812.According to Withers William Henry Lintott died in 1816. In this case his son must have had the same name as his father as a William Henry Lintott again became mayor in 1822.Lit.: P. and B. R. Withers, The Token Book. British Tokens of the 17th 18th and 19th centuries and their values (2010) p. 397 no. 41. @en
function or role: Münzherr
in scheme: corporation
created: 2024-05-10
modified: 2024-05-10

Münzherr
preferred label: Authority @en