Foundation of the Hellenic World
type: Concept
type: corporation
definition: Private Kulturstiftung, gegründet und finanziert von Lazaros Efraimoglou. Ihre Gründung wurde 1993 durch das griechische Parlament ratifiziert.
definition: The Foundation of the Hellenic World (FHW), which was envisioned, founded and funded by the family of Lazaros Efraimoglou, is a privately funded not-for-profit cultural institution based in Athens. Its foundation was ratified in 1993 by unanimous vote of the Hellenic Parliament. @en
function or role: Vorbesitzer
in scheme: corporation
created: 2024-05-10
modified: 2024-10-18

Vorbesitzer
preferred label: previous Owner @en