Stadtbibliothek Frankfurt am Main
type: Concept
type: corporation
preferred label: City Library Frankfurt am Main @en
definition: Die Münzsammlung der Frankfurter Stadtbibliothek wurde im Herbst 1927 in das Historische Museum überführt.Der Gesamtbestand betrug damals 20.000 Stücke, davon 2/3 Frankfurter Münzen und Medaille. Betreuer war bis 1932 der Bibliothekar Clemens Ebrard.Die Anfänge der Sammlung liegen 1749, als am 12. Mai des Jahres Frau von Barckhaus 3.296 griechische und römische Münzen der Stadtbibliothek schenkte, verbunden mit einem Legat von 1.000 Gulden, deren Zinsen dem kümmernden Bibilothekar zukamen.
definition: The coin collection of the Frankfurt City library was transferred to the Museum of History in autumn 1927.The collection numbered 20,000 objects in total, of which two thirds were coins issued by the city of Frankfurt. Its head until 1932 was the librarian Clemens Ebrard.The origins of the collection go back to the 18th century, when on 12 May 1749 Mrs von Barckhaus donated 3,296 Greek and Roman coins to the Civic library, including a bequest of 1,000 guldens, the interest of which was to be used to pay for the librarian's salary. @en
function or role: Vorbesitzer
in scheme: corporation
created: 2024-05-10
modified: 2026-05-01
creator: mk berlin

Vorbesitzer
preferred label: previous Owner @en