Edward J. Waddell Ltd. (Bethesda, Maryland/USA)
type: Concept
type: corporation
definition: Als Münzhandelsfirma tätig seit 1975 (zunächst als Firma Birkler and Waddell, Washington D. C., zusammen mit Lucien Birkler).Ab 1981 als Edward J. Waddell Ltd., Frederick bzw. Bethesda, Maryland (USA).Inhaber Edward J. Waddell (geboren 1953), Studium der Kunstgeschichte an der Northwestern University, Evanstown, Illinois (USA).
definition: Coin dealing company active since 1975 (first as Birkler and Waddell, Washington D. C., together with Lucien Birkler).Established as Edward J. Waddell Ltd., Frederick resp. Bethesda, Maryland (USA) in 1981.The owner Edward J. Waddell (born 1953) studied Art history at Northwestern University, Evanstown, Illinois (USA). @en
function or role: Veräußerer (an Museum)
function or role: Veräußerer (an Vorbesitzer)
in scheme: corporation
created: 2024-05-10
modified: 2024-10-30

Veräußerer (an Museum)
preferred label: Vendor (to Museum) @en

Veräußerer (an Vorbesitzer)
preferred label: Vendor (to prev. Owner) @en