Reichsamt für Wetterdienst
type: Concept
type: corporation
definition: Präsidium des Reichsamts für Wetterdienst. Das Reichsamt wurde 1934 in Berlin gegründet und unterstand dem Reichsluftfahrtministerium.Geschenk einer Medaille auf den Meteorologen Gustav Hellmann von Rudolf Bosselt an das Münzkabinett Berlin im Jahre 1936.
definition: Präsidium des Reichsamts für Wetterdienst (head departement of the Office for Metrological Service). The Office was founded in Berlin in 1934 and was subordinate to the Reichsluftfahrtministerium (Ministry of Aviation).Donation of a medal on the meteorologist Gustav Hellmann by Rudolf Bosselt to the Münzkabinett Berlin in 1936. @en
function or role: Vorbesitzer
in scheme: corporation
created: 2024-05-10
modified: 2024-05-10

Vorbesitzer
preferred label: previous Owner @en