Konsulat Beirut
type: Concept
type: corporation
preferred label: Beirut Consolate @en
definition: Konsulat Beirut.Im Jahre 1934 erwarb das Münzkabinett Berlin vom Konsulat in Beirut (moderne) syrische Münzen.Das Konsulat ist nicht näher bezeichnet, aber offensichtlich war es das der Mandatsmacht Frankreich.
definition: Beirut (Beyrouth) Consulate.In 1934 the Münzkabinett Berlin purchased (modern) Syrian coins from the Consulate in Beirut. The consulate is not being named properly, but obviously refers to one run by the French Republic. @en
function or role: Vorbesitzer
in scheme: corporation
created: 2024-05-10
modified: 2024-05-10

Vorbesitzer
preferred label: previous Owner @en