Stadt Neuss
type: Concept
type: corporation
preferred label: City of Neuss @en
definition: Stadt Neuss, Museum.Geschenk einer Münze an das Münzkabinett Berlin im Jahr 1937 für die im Vorjahr durch das Münzkabinett Berlin erfolgte Bestimmung von Münzen und Medaillen.
definition: City of Neuss, Museum.Donation of a coin to the Münzkabinett Berlin in 1937 for the identification of coins and medals by the Münzkabinett Berlin in the previous year. @en
function or role: Vorbesitzer
in scheme: corporation
created: 2024-05-10
modified: 2024-05-10

Vorbesitzer
preferred label: previous Owner @en