Gold- und Silberscheideanstalt R. Götze (Berlin)
type: Concept
type: corporation
definition: R. Götze & Co., Gold- und Silberscheideanstalt, Griebenowstr. 20, Berlin.Das Unternehmen existiert heute noch in Berlin.Im Jahre 1936 erwarb das Münzkabinett Berlin von der Firma Götze mehrere Münzen.
definition: R. Götze & Co., Gold and Silberscheideanstalt, Griebenowstrasse 20, Berlin.The company still exists in Berlin today.In 1936 the Münzkabinett Berlin bought several coins from the Götze company. @en
function or role: Veräußerer (an Museum)
in scheme: corporation
created: 2024-05-10
modified: 2024-05-10

Veräußerer (an Museum)
preferred label: Vendor (to Museum) @en