Westfälische Auktionsgesellschaft
type: Concept
type: corporation
definition: Die Firma Westfälische Auktionsgesellschaft bestand von 1992 bis 2020.Begründet von Udo Gans und Günther Hild.Ging zusammen mit der Münzhandlung Udo Gans Arnsberg am 1. Januar 2021 in der WAG Udo Gans e.K., Auktionen und Münzenhandel auf.
definition: The company Westfälische Auktionsgesellschaft existed from 1992 to 2020.It had been established by Udo Gans and Günther Hild.The company was amalgated with the Münzhandlung Udo Gans Arnsberg to create the WAG Udo Gans e.K., Auktionen und Münzenhandel on 1 January 2021. @en
function or role: Veräußerer (an Museum)
function or role: Veräußerer (an Vorbesitzer)
in scheme: corporation
created: 2024-05-10
modified: 2024-05-10

Veräußerer (an Museum)
preferred label: Vendor (to Museum) @en

Veräußerer (an Vorbesitzer)
preferred label: Vendor (to prev. Owner) @en