Blitha-Vereycken (Wilrijk)
type: Concept
type: corporation
definition: Belgischer Spielzeug, Maschinen und Medaillenhersteller.
definition: Belgian producer of toys, machines, and medals. @en
function or role: Hersteller
in scheme: corporation
created: 2025-10-02
creator: mk berlin

Hersteller
preferred label: Producer @en