Bechtler Mint
type: Concept
type: corporation
preferred label: Bechtler's Mint @en
definition: Private, von Christoph Bechtler (1782-1843) und seiner Familie von 1831 bis in die 1850er Jahre betriebene Münzstätte in Rutherford, North Carolina.
definition: Private mint operated by Christoph Bechtler (1782-1843) and his family from 1831 through the 1850ies in Rutherford, North Carolina. @en
function or role: Hersteller
in scheme: corporation
created: 2025-10-10
modified: 2025-10-10
creator: mk berlin

Hersteller
preferred label: Producer @en