Hamburgische Münze
type: Concept
type: corporation
definition: Münzstätte des Bundeslandes Hamburg für die Bundesrepublik Deutschland.Münzzeichen J seit 1875.
definition: Mint of the National State of Hamburg for the Federal Republic of Germany.Mint mark J since 1875. @en
function or role: Hersteller
in scheme: corporation
created: 2025-11-03
creator: mk berlin

Hersteller
preferred label: Producer @en