Giesserei Lessiak
type: Concept
type: corporation
definition: Gießerei Lessiak in Hamburg.Belegt um 1900.
definition: Lessiak Foundry in Hamburg.Attested in c. 1900. @en
function or role: Hersteller
in scheme: corporation
created: 2025-11-03
modified: 2025-11-03
creator: mk berlin

Hersteller
preferred label: Producer @en