J. R. Gaunt and Son Ltd.
type: Concept
type: corporation
definition: Firma begründet durch James Richard Gaunt und seinen Sohn Charles Frederick Gaunt in Birmingham im Jahre 1884.Produktion von Medaillen, Knöpfen und Abzeichen.Filiale in London ab 1905.
definition: Company established in Birmingham in 1884 by James Richard Gaunt and son Charles Frederick Gaunt.Manufacturer of badges, buttons, and medals.London offices opened in 1905. @en
function or role: Hersteller
in scheme: corporation
created: 2025-11-25
modified: 2025-11-25
creator: mk berlin

Hersteller
preferred label: Producer @en