1. Dresdner Medaillenmünze Glaser & Sohn
type: Concept
type: corporation
definition: Firma gegründet 1868 durch Moritz Glaser und Sohn Richard Glaser.1972 verstaatlicht als VEB Dresdner Medaillenmünze. 1990 wiederbegründet als das Privatunternehmen I. Dresdner Medaillenmünze Glaser & Sohn GmbH.
definition: The Dresden based company was founded in 1868 by Moritz Glaser and his son Richard Glaser.In 1972 the company became a state run enterprise (VEB Dresdner Medaillenmünze), and was re-privatized in 1990 as I. Dresdner Medaillenmünze Glaser & Sohn GmbH. @en
function or role: Hersteller
in scheme: corporation
created: 2024-05-10
modified: 2024-09-07

Hersteller
preferred label: Producer @en