Dr. Jacob Hirsch (München)
type: Concept
type: corporation
preferred label: Dr. Jacob Hirsch (Munich) @en
definition: Münzhandlung in München, aktiv 1897 bis ca. 1919.Dr. Jacob Hirsch (1874-1955) war ein Neffe Heinrich Hirschs (1820-1886). Er führte auch den Titel eines Hofrats.Er ging nach dem Ersten Weltkrieg in die Schweiz, siehe Firma Dr. Jacob Hirsch (Genf), wo er von 1921 bis 1938 unter dem Firmennamen Ars Classica 18 Auktionen durchführte. Nach 1945 Firmensitze in Paris und New York.Lit.: M. Barth - E. M. Pegan, JNG 65, 2015, 254-256. 308 f.; L. Mildenberg, Nachruf, Schweizer Münzblätter, 17, 1955, 105-107.
definition: Coin dealer in Munich, active from 1897 to c. 1919.Dr. Jacob Hirsch (1874-1955) was a nephew of Heinrich Hirsch (1820-1886), and was granted the title of Hofrat.Hirsch moved to Switzerland after World War One, see entry for the company Dr. Jacob Hirsch (Genf), where he did 18 auction sales under the name of Ars Classica from 1921 to 1938. After 1945 the company resided in Paris and New York.Lit.: M. Barth - E. M. Pegan, JNG 65, 2015, pp. 254-256, 308-309; L. Mildenberg, Obituary, Schweizer Münzblätter, 17, 1955, pp. 105-107. @en
function or role: Veräußerer (an Museum)
function or role: Veräußerer (an Vorbesitzer)
in scheme: corporation
created: 2024-05-10
modified: 2024-05-10

Veräußerer (an Museum)
preferred label: Vendor (to Museum) @en

Veräußerer (an Vorbesitzer)
preferred label: Vendor (to prev. Owner) @en