C. und E. Canessa (Neapel)
type: Concept
type: corporation
preferred label: C. and E. Canessa (Naples) @en
definition: Münzhändler und Auktionatoren in Neapel mit Filialen in Paris und New York.Cesare Canessa (1863-1922), Ercole C. (1868-1929), Ambrogioa C. (geb. 1900), Guglielmo C. (1905-1975).Lit.: MEC I 401; H. Rambach, NAC Auktion 91 vom 23. Mai 2016 Provenance Glossary.
definition: Coin dealers in Naples with offices in Paris and New York.Cesare Canessa (1863-1922), Ercole C. (1868-1929), Ambrogioa C. (born 1900), Guglielmo C. (1905-1975).Lit.: MEC I p. 401; H. Rambach, NAC Auction 91 on 23 May 2016 Provenance Glossary. @en
function or role: Veräußerer (an Museum)
function or role: Veräußerer (an Vorbesitzer)
in scheme: corporation
created: 2024-05-10
modified: 2024-05-10

Veräußerer (an Museum)
preferred label: Vendor (to Museum) @en

Veräußerer (an Vorbesitzer)
preferred label: Vendor (to prev. Owner) @en