Reichspostmuseum
type: Concept
type: corporation
definition: Reichspostmuseum, gegründet 1872.Die Nachfolgeeinrichtung am selben Ort sind das Postmuseum der DDR (begründet 1987) und das im Jahr 2000 wiedereröffnete Museum für Kommunikation.Vom Reichspostmuseum im Jahre 1872 für das Münzkabinett Berlin erhalten.
definition: Reichspostmuseum, established in 1872.Its successors are the Museum at the very same place, and the Postal Museum of the GDR (founded in 1987), and the Museum of Communication, which was reopened in 2000.Given by the Reichspostmuseum to the Münzkabinett Berlin in 1872. @en
function or role: Vorbesitzer
in scheme: corporation
created: 2024-05-10
modified: 2024-05-10

Vorbesitzer
preferred label: previous Owner @en