Antiquariat M. Lempertz (P. Hanstein)
type: Concept
type: corporation
definition: Der Name M. Lempertz' Buch- und Kunstantiquariat wurde durch Peter Hanstein (1853-1925) 1875 für seine Firma erworben. Zuerst nur in Bonn, dann auch wieder in Köln ansässig.Buchhandel und Kunstauktionsgeschäft.Hervorgegangen aus Mathias Lempertz (1821-1886) Buchhandlung und Antiquariat (gegründet 1845, eigenständig 1854) in Bonn.Seit 1912 Teilnahme der Söhne, die das Geschäft nach 1925 fortführen.
definition: Peter Hanstein (1853-1925) purchased the name of M. Lempertz' Buch- und Kunstantiquariat for his comapny in 1875. Firstly exclusively based in Bonn, later also active in Cologne.The company sold books and organised auctions of objects of art.It originates in the company founded by Mathias Lempertz (1821-1886). Book shop and dealer on antiquities (foundet in 1845, became his independent business in 1854) in Bonn.From 1912 Hanstein's sons joined the company, and continued the business after 1925. @en
function or role: Veräußerer (an Museum)
function or role: Veräußerer (an Vorbesitzer)
in scheme: corporation
created: 2024-05-10
modified: 2024-05-10

Veräußerer (an Museum)
preferred label: Vendor (to Museum) @en

Veräußerer (an Vorbesitzer)
preferred label: Vendor (to prev. Owner) @en