Münzkabinett der Staatlichen Museen zu Berlin
type: Concept
type: corporation
preferred label: Münzkabinett of the Staatliche Museen in Berlin @en
definition: Vormals im Besitz des Münzkabinetts der Staatlichen Museen zu Berlin (ab 1918) bzw. dessen Vorgängers, dem Münzkabinett der Königlichen Museen zu Berlin (1868-1918) bzw. der Münzsammlung im Antiquarium bzw. der Kunstkammer der preußischen Kurfürsten und Könige.Vom 17. Jh. an bis zum Jahr 1830 ist das Münzkabinett eine von vier Abteilungen des kurfürstlichen bzw. ab 1701 Königlichen Kunstbesitzes (neben Antikensammlung [Antiquarium], Kunstkammer und Naturalienkabinett).1830 wird es dem Antiquarium im Alten Museum angeschlossen. Bis 1868 werden antiken Münzen auf der einen sowie mittelalterliche, neuzeitliche Gepräge sowie Medaillen auf der anderen Seite getrennt voneinander verwaltet.Zum 1. Oktober 1868 erhielt das Münzkabinett den Rang eines eigenständigen Museums.
definition: Previously with the Münzkabinett der Staatlichen Museen zu Berlin (from 1918) resp. its predecessor of the Royal Museums (1868-1918) resp. the Antiquarium and Kunstkammer of the Prussian electors and kings.From the 17th century to 1830 the coin cabinet was one of four divisions of the Electoral resp. from 1701 Royal collection (together with the collection of antiquities [Antiquarium], the Art chamber [Kunstkammer] and the Naturalienkabinett).In 1830 it became a part of the Antiquarium in the Altes Museum. Until 1868 ancient coins on the one hand and medieval and modern coins & medals on the other hand were managed separately.The Münzkabinett became a Museum in its own right (according to the Statute) within the Royal Museums on 1 October 1868. @en
function or role: Vorbesitzer
function or role: Auftraggeber
in scheme: corporation
created: 2024-05-10
modified: 2025-02-12
creator: mk berlin

Vorbesitzer
preferred label: previous Owner @en

Auftraggeber
preferred label: Commissioner @en