Städtisches Museum Stettin
type: Concept
type: corporation
preferred label: City Museum Stettin @en
definition: Das Städtische Museum Stettin (heute Szczecin in Polen) bestand von 1913 bis 1945.Eine polnische Nachfolgeinstitution wurde am 1. August 1945 als Muzeum Narodowe w Szczecinie gegründet.Geschenk einer Bleikopie an das Münzkabinett Berlin im Jahr 1934.
definition: The Städtische Museum Stettin (City Museum Stettin, today Szczecin in Poland) existed from 1913 to 1945.Its Polish successor institution is the Muzeum Narodowe w Szczecinie, foundet on 1 August 1945.Donation of a copy in lead to the Münzkabinett Berlin in 1934. @en
function or role: Vorbesitzer
in scheme: corporation
created: 2024-05-10
modified: 2024-05-10

Vorbesitzer
preferred label: previous Owner @en