Firma Ralph Heaton & Sons (Birmingham Mint)
type: Concept
type: corporation
preferred label: Company Ralph Heaton & Sons (Birmingham Mint) @en
definition: Prägefirma in Birmingham ab 1850.Prägte britische Münzen in Zusammenarbeit mit der Royal Mint sowie auch Münzen fremder Staaten. Stellt auch Medaillen und token her, gab letztere auch selbst ausUnternehmen verkauft 2003.
definition: Minting company in Birmingham, active from 1850.Ralph Heaton & Sons (Birmingham Mint) struck British coins in cooperation with the Royal mint, and also those of foreign states. The company was a producer of medals and tokens, too. In addition it did issue its own tokens.The company was sold in 2003. @en
function or role: Hersteller
function or role: Münzherr
in scheme: corporation
created: 2024-05-10
modified: 2024-05-10

Hersteller
preferred label: Producer @en

Münzherr
preferred label: Authority @en