Taler (Palmbaumtaler)
type: Concept
type: denomination
definition: Rufname für eine Gruppe von meist norddeutschen Talermünzen des 17. Jahrhunderts, deren Rückseite einen Palmbaum zeigt.
definition: Inofficial and colloquial name used for a group of mostly North German Taler coins of the 17th century, which show a palm tree on their reverses. @en
in scheme: denomination
created: 2024-05-10
modified: 2024-05-10