Vierling (1/4 Pfennig)
type: Concept
type: denomination
definition: Bitte die id [1197] Quadrans (MA)/Vierling verwenden.
definition: Please use id [1197] Quadrans (MA)/Vierling instead. @en
in scheme: denomination
created: 2024-05-10
modified: 2024-05-10