Trikephalon (Asper, 1261-94)
type: Concept
type: denomination
definition: Bezeichnung eines Aspron Trachy (1/3 Hyperpyron) unter Michael VIII. und später zwischen 1261 und 1294, welches drei Köpfe (Kaiser, Jungfrau Maria, Christus) zeigt.
definition: Aspron Trachy (1/3 Hyperpyron) issued during the reign of Michael VIII and later between 1261 and 1294, which features three heads (Emperor, Virgin, Christ). @en
in scheme: denomination
created: 2024-05-10
modified: 2024-05-10