Tournesion
type: Concept
type: denomination
definition: Griechische Bezeichnung paläologischer Zeit für eine Billon- bzw. Kupfermünze. Der Begriff selbst geht auf das Vorbild der Tornesen in Griechenland zurück, welche wiederum auf den älteren silbernen Gros Tournois verweisen.Lit.: Ph. Grierson, Byzantine Coins in the Dumbarton Oaks Collection and the Whittemore Collection V (1999) 31 f. 51 f.
definition: Palaiologan billon or copper denomination (plural tornesia) struck on the weight and model of the denier tournois that circulated in Frankish Greece at the time.Compare Lit.: Ph. Grierson, Byzantine Coins in the Dumbarton Oaks Collection and the Whittemore Collection V (1999) pp. 31-32, 51-52. @en
in scheme: denomination
created: 2024-05-10
modified: 2024-05-10