1/3 Miliaresion
type: Concept
type: denomination
definition: 1/3-Stück der bereits 720 durch Leo III. in Byzanz eingeführten Silbermünze (zu zunächst 1/144 des römischen Pfundes). Eine Ausprägung erfolgte erst im 11. Jh.
definition: Byzantine silver denomination with the value of 1/3 of the miliaresion. The coin was struck from the time of Emperor Romanos IV Diogenes (1068-1071) until the coinage reforms under Alexios I (1081-1118) in 1092. @en
in scheme: denomination
created: 2024-05-10
modified: 2024-05-10