1 1/2 Pence (3 Halfpence, GBP)
type: Concept
type: denomination
definition: Englische Silbermünze unter Elizabeth I., zuletzt geprägt 1582. Britische Silbermünze, geprägt nur zwischen 1834 und 1843 sowie in 1860 und 1862.
in scheme: denomination
created: 2024-05-10
modified: 2024-05-10