Doppelnummus
type: Concept
type: denomination
preferred label: Double Nummus @en
definition: Doppelstück zu rund 40 g zum bronzen Nummus in Italien im 3. Jh. v. Chr.Vgl. N. K. Rutter, Historia Numorum. Italy (2001) Nr. 718.
definition: A coin of c. 40 grams representing the double of a regular nummus in Italy during the third century BC.Compare N. K. Rutter, Historia Numorum. Italy (2001) no. 718. @en
in scheme: denomination
created: 2024-05-10
modified: 2024-05-10