1 1/2 Lira
type: Concept
type: denomination
definition: Münzen im Werte einer anderthalbfachen Lira (30 Soldi) wurden in Venetien bis kurz nach dem Beginn des 19. Jhs. ausgeprägt.
definition: Coin valued as one and a half Lira (30 soldi) were struck in Venetia until shortly after the begin of the 19th century. @en
in scheme: denomination
created: 2024-05-10
modified: 2024-05-10