2 1/2 Nummi
type: Concept
type: denomination
definition: Kleine Bronzeeinheit der Völkerwanderungszeit, die versuchsweise als zweieinhalb Nummi angesprochen und häufig auch als minimus (ohne weitere Angabe des Werts in Nummi) bezeichnet wird. Vgl. M. Metlich, The coinage of Ostrogothic Italy (2004).
definition: Small bronze coin of the Migration period identified to have been valued as 2 1/2 Nummi, and often also is called a minimus (without any valuation in nummi). Compare M. Metlich, The coinage of Ostrogothic Italy (2004). @en
in scheme: denomination
created: 2024-05-10
modified: 2024-05-10