Doppelschilling (pommersch)
type: Concept
type: denomination
preferred label: Doppelschilling (Pomeranian) @en
definition: Währungsbezeichnung für zwei Schilling-Münzen nach dem im Zuge der Kipperzeit eingeführten leichteren pommerschen Münzfuß. Wird nur verwendet, wenn in der Aufschrift der 2 Schillingsmünze explizit die Bezeichnung „pommersch“ (POM, PO, o.ä.) vorkommt.
in scheme: denomination
created: 2024-05-10
modified: 2024-05-10