24 Pfennig (1/20 Taler)
type: Concept
type: denomination
definition: Nominal der Kipperzeit, welches Hamburg und Lübeck in einer Gemeinschaftsausgabe prägen ließen, um der aufkommenden 1 Taler = 40 Schilling-Rechnung begegnen zu können.
definition: A denomination used during the Kipperzeit by Hamburg and Lübeck in shared emissions in order to be better able to deal with the 1 Taler = 40 Schillings conversion. @en
in scheme: denomination
created: 2024-05-10
modified: 2024-05-10