1/8 Gulden (7 Kreuzer)
type: Concept
type: denomination
definition: In Fribourg gebräuchliches Nominal zu 7 Kreuzer. Der Viertelgulden zu 14 Kreuzer ist die volle Einheit.
in scheme: denomination
created: 2024-05-10
modified: 2024-05-10