3 Nummi
type: Concept
type: denomination
definition: Byzantinisches Mehrfachstück des bronzenen Nummus, nur in Ägypten während des 6. und 7. Jhs. ausgegeben. Trägt das Wertzeichen Γ = drei.
definition: A copper denomination with the value of 3 nummi. The coin bears a mark of value in Greek (Γ). It was struck only in Egypt throughout the period the mint in Alexandria remained in operation under Byzantine control, between the early sixth and mid-seventh century. @en
in scheme: denomination
created: 2024-05-10
modified: 2024-05-10