1/4 Solidus
type: Concept
type: denomination
definition: Byzantinisches Teilstück des Solidus. Nur unter Iustinianus II. in seiner zweiten Regierung (705-711) geprägt
definition: Byzantine fractional gold denomination with the value of 1/4 of the solidus. The only known examples were struck during the second reign of Emperor Justinian II (705-711). @en
in scheme: denomination
created: 2024-05-10
modified: 2024-05-10