Barile
type: Concept
type: denomination
definition: Florentinisches Nominal der 1. Hälfte des 16. Jahrhunderts zu ca. 12-13 Soldi.Lit.: F. von Schröter, Wörterbuch der Münzkunde (1930) 58.
in scheme: denomination
created: 2024-09-11
modified: 2024-09-11